Target
Interleukin-1 receptor-associated kinase 4
Ligand
BDBM50511364
Substrate
Meas. Tech.
ChEMBL_1859084 (CHEMBL4359940)
Ki
5.1±n/a nM
Citation
 Bryan, MCDrobnick, JGobbi, AKolesnikov, AChen, YRajapaksa, NNdubaku, CFeng, JChang, WFrancis, RYu, CChoo, EFDeMent, KRan, YAn, LEmson, CHuang, ZSujatha-Bhaskar, SBrightbill, HDiPasquale, AMaher, JWai, JMcKenzie, BSLupardus, PJZarrin, AAKiefer, JR Development of Potent and Selective Pyrazolopyrimidine IRAK4 Inhibitors. J Med Chem 62:6223-6240 (2019)  
Target
Name:
Interleukin-1 receptor-associated kinase 4
Synonyms:
IRAK-4 IRAK4_HUMAN Interleukin-1 receptor-associated kinase 4 (IRAK4) | Renal carcinoma antigen NY-REN-64
Type:
Protein
Mol. Mass.:
51519.08
Organism:
Homo sapiens (Human)
Description:
Q9NWZ3
Residue:
460
  
Inhibitor
Name:
BDBM50511364
Synonyms:
CHEMBL4466517 | US10988478, Example 31
Type:
Small organic molecule
Emp. Form.:
C21H23N5O4
Mol. Mass.:
409.4384
SMILES:
C[C@]1(CO)Cc2cc(NC(=O)c3cnn4cccnc34)c(cc2O1)N1CCOCC1
: