Target
D(1A) dopamine receptor
Ligand
BDBM50070194
Substrate
Meas. Tech.
ChEBML_58297
IC50
7530±n/a nM
Citation
 Mantegani, SBrambilla, ECaccia, CDamiani, GFornaretto, MGMcArthur, RAVarasi, M Serotonergic ergoline derivatives. Bioorg Med Chem Lett 8:1117-22 (1999)  
Target
Name:
D(1A) dopamine receptor
Synonyms:
DOPAMINE D1 Dopamine D1 high Dopamine receptor Dopamine1-like Drd1a
Type:
Enzyme Catalytic Domain
Mol. Mass.:
49429.75
Organism:
RAT
Description:
P18901
Residue:
446
  
Inhibitor
Name:
BDBM50070194
Synonyms:
(6aR,9R,10aR)-3-tert-Butyl-7,9-dimethyl-4,6,6a,7,8,9,10,10a-octahydro-indolo[4,3-fg]quinoline | CHEMBL13811
Type:
Small organic molecule
Emp. Form.:
C20H28N2
Mol. Mass.:
296.4497
SMILES:
C[C@@H]1C[C@H]2[C@@H](Cc3c[nH]c4c(ccc2c34)C(C)(C)C)N(C)C1
: