Target
Mu-type opioid receptor
Ligand
BDBM50370595
Substrate
Meas. Tech.
ChEMBL_1859900 (CHEMBL4360756)
EC50
25±n/a nM
Citation
 Dvorácskó, SKeresztes, AMollica, AStefanucci, AMacedonio, GPieretti, SZádor, FWalter, FRDeli, MAKékesi, GBánki, LTuboly, GHorváth, GTömböly, C Preparation of bivalent agonists for targeting the mu opioid and cannabinoid receptors. Eur J Med Chem 178:571-588 (2019)  
Target
Name:
Mu-type opioid receptor
Synonyms:
MOR-1 Mu-type opioid receptor (MOR) OPRM_RAT Opioid receptor B Ror-b
Type:
G Protein-Coupled Receptor (GPCR)
Mol. Mass.:
44503.11
Organism:
Rattus norvegicus (rat)
Description:
Competition binding assays were carried out using membrane preparations from transfected HN9.10 cells that constitutively expressed the mu opioid receptor.
Residue:
398
  
Inhibitor
Name:
BDBM50370595
Synonyms:
OXYCODONE US1184575, oxycodone | US9233167, Oxycodone
Type:
Small organic molecule
Emp. Form.:
C18H21NO4
Mol. Mass.:
315.3636
SMILES:
COc1ccc2C[C@H]3N(C)CC[C@@]45[C@@H](Oc1c24)C(=O)CC[C@@]35O
: