Target
Adenosine deaminase
Ligand
BDBM50070642
Substrate
Meas. Tech.
ChEBML_30791
Ki
0.890000±n/a nM
Citation
 Curtis, MAVarkhedkar, VPragnacharyulu, PVAbushanab, E Adenosine deaminase inhibitors. Synthesis and biological evaluation of aralkyladenines (ARADS). Bioorg Med Chem Lett 8:1639-42 (1999)  
Target
Name:
Adenosine deaminase
Synonyms:
ADA Adenosine aminohydrolase
Type:
Enzyme
Mol. Mass.:
40910.44
Organism:
Bos taurus (bovine)
Description:
Residue:
363
  
Inhibitor
Name:
BDBM50070642
Synonyms:
(2S,3R)-3-(6-Amino-purin-9-yl)-6-phenyl-hexan-2-ol CHEMBL295417
Type:
Small organic molecule
Emp. Form.:
C17H21N5O
Mol. Mass.:
311.3815
SMILES:
C[C@H](O)[C@@H](CCCc1ccccc1)n1cnc2c(N)ncnc12
: