Target
Prothrombin
Ligand
BDBM50070825
Substrate
Meas. Tech.
ChEBML_208345
Ki
4±n/a nM
Citation
 Isaacs, RCCutrona, KJNewton, CLSanderson, PESolinsky, MGBaskin, EPChen, IWCooper, CMCook, JJGardell, SJLewis, SDLucas, RJLyle, EALynch, JJNaylor-Olsen, AMStranieri, MTVastag, KVacca, JP C6 modification of the pyridinone core of thrombin inhibitor L-374,087 as a means of enhancing its oral absorption. Bioorg Med Chem Lett 8:1719-24 (1999)  
Target
Name:
Prothrombin
Synonyms:
Activation peptide fragment 1 Coagulation factor II Prothrombin precursor Thrombin heavy chain | Thrombin light chain
Type:
Protein
Mol. Mass.:
70029.57
Organism:
Homo sapiens (Human)
Description:
P00734
Residue:
622
  
Inhibitor
Name:
BDBM50070825
Synonyms:
CHEMBL49457 | N-(6-Amino-2-methyl-pyridin-3-ylmethyl)-2-[3-(4-chloro-phenylmethanesulfonylamino)-6-cyclopropyl-2-oxo-2H-pyridin-1-yl]-acetamide
Type:
Small organic molecule
Emp. Form.:
C24H26ClN5O4S
Mol. Mass.:
516.012
SMILES:
Cc1nc(N)ccc1CNC(=O)Cn1c(ccc(NS(=O)(=O)Cc2ccc(Cl)cc2)c1=O)C1CC1
: