Target
Serine protease 1
Ligand
BDBM50067796
Substrate
Meas. Tech.
ChEBML_210683
Ki
3200±n/a nM
Citation
 Isaacs, RCCutrona, KJNewton, CLSanderson, PESolinsky, MGBaskin, EPChen, IWCooper, CMCook, JJGardell, SJLewis, SDLucas, RJLyle, EALynch, JJNaylor-Olsen, AMStranieri, MTVastag, KVacca, JP C6 modification of the pyridinone core of thrombin inhibitor L-374,087 as a means of enhancing its oral absorption. Bioorg Med Chem Lett 8:1719-24 (1999)  
Target
Name:
Serine protease 1
Synonyms:
Alpha-trypsin chain 1 Beta-trypsin PRSS1 TRP1 TRY1_HUMAN Thrombin & trypsin Trypsin I | Trypsin-1
Type:
Enzyme
Mol. Mass.:
26557.80
Organism:
Homo sapiens (Human)
Description:
P07477
Residue:
247
  
Inhibitor
Name:
BDBM50067796
Synonyms:
CHEMBL11157 N-((6-amino-2-methylpyridin-3-yl)methyl)-2-(6-methyl-2-oxo-3-(phenylmethylsulfonamido)pyridin-1(2H)-yl)acetamide | N-(6-Amino-2-methyl-pyridin-3-ylmethyl)-2-(6-methyl-2-oxo-3-phenylmethanesulfonylamino-2H-pyridin-1-yl)-acetamide
Type:
Small organic molecule
Emp. Form.:
C22H25N5O4S
Mol. Mass.:
455.53
SMILES:
Cc1nc(N)ccc1CNC(=O)Cn1c(C)ccc(NS(=O)(=O)Cc2ccccc2)c1=O
: