Target
Carbonic anhydrase 4
Ligand
BDBM50515867
Substrate
Meas. Tech.
ChEMBL_1862729 (CHEMBL4363585)
Ki
1.5±n/a nM
Citation
 Kalinin, SNocentini, AKovalenko, ASharoyko, VBonardi, AAngeli, AGratteri, PTennikova, TBSupuran, CTKrasavin, M From random to rational: A discovery approach to selective subnanomolar inhibitors of human carbonic anhydrase IV based on the Castagnoli-Cushman multicomponent reaction. Eur J Med Chem 182:0 (2019)  
Target
Name:
Carbonic anhydrase 4
Synonyms:
CA-IV CAH4_HUMAN Carbonic anhydrase Carbonic anhydrase IV (CA IV)
Type:
Enzyme
Mol. Mass.:
35037.98
Organism:
Homo sapiens (Human)
Description:
P22748
Residue:
312
  
Inhibitor
Name:
BDBM50515867
Synonyms:
CHEMBL4475435
Type:
Small organic molecule
Emp. Form.:
C24H29ClN4O5S
Mol. Mass.:
521.029
SMILES:
NS(=O)(=O)c1ccc(cc1)N1[C@@H]([C@H](CC1=O)C(=O)NCCCN1CCOCC1)c1ccc(Cl)cc1
: