Target
17-beta-hydroxysteroid dehydrogenase type 2
Ligand
BDBM50466019
Substrate
Meas. Tech.
ChEMBL_1863749 (CHEMBL4364724)
IC50
1.3±n/a nM
Citation
 Abdelsamie, ASSalah, MSiebenbürger, LHamed, MMBörger, Cvan Koppen, CJFrotscher, MHartmann, RW Development of potential preclinical candidates with promising in vitro ADME profile for the inhibition of type 1 and type 2 17?-Hydroxysteroid dehydrogenases: Design, synthesis, and biological evaluation. Eur J Med Chem 178:93-107 (2019)  
Target
Name:
17-beta-hydroxysteroid dehydrogenase type 2
Synonyms:
17-beta-Hydroxysteroid Dehydrogenase 2 (17-beta-HSD2) 20-alpha-HSD EDH17B2 Estradiol 17-beta-dehydrogenase 2 (17beta-HSD2) Microsomal 17-beta-hydroxysteroid dehydrogenas Testosterone 17-beta-dehydrogenase
Type:
Oxidoreductase; single-pass type II membrane protein
Mol. Mass.:
42795.29
Organism:
Homo sapiens (Human)
Description:
Enzyme was partially purified from human placenta.
Residue:
387
  
Inhibitor
Name:
BDBM50466019
Synonyms:
CHEMBL4286251
Type:
Small organic molecule
Emp. Form.:
C19H13F3O3S
Mol. Mass.:
378.365
SMILES:
Cc1cc(cc(C)c1O)-c1ccc(s1)C(=O)c1cc(F)c(F)c(O)c1F
: