Target
Cholesteryl ester transfer protein
Ligand
BDBM50516405
Substrate
Meas. Tech.
ChEMBL_1865110 (CHEMBL4366085)
IC50
5.0±n/a nM
Citation
 Finlay, HJJiang, JRampulla, RSalvati, MEQiao, JXWang, TCLawrence, RMHarikrishnan, LSKamau, MGTaylor, DSChen, AYAYin, XHuang, CSChang, MChen, XQSleph, PGXu, CLi, JLevesque, PAdam, LPWexler, RR Discovery of a Lead Triphenylethanamine Cholesterol Ester Transfer Protein (CETP) Inhibitor. ACS Med Chem Lett 10:911-916 (2019)  
Target
Name:
Cholesteryl ester transfer protein
Synonyms:
CETP Cholesteryl ester transfer protein (CETP) | Lipid transfer protein I
Type:
Enzyme
Mol. Mass.:
54751.53
Organism:
Homo sapiens (Human)
Description:
P11597
Residue:
493
  
Inhibitor
Name:
BDBM50516405
Synonyms:
CHEMBL4552555
Type:
Small organic molecule
Emp. Form.:
C30H27F12NO4
Mol. Mass.:
693.5205
SMILES:
CC(C)Oc1cc(ccc1F)[C@@](Cc1ccccc1)(NCC(O)C(O)(C(F)(F)F)C(F)(F)F)c1cc(F)cc(OC(F)(F)C(F)F)c1
: