Target
Cereblon isoform 4
Ligand
BDBM65454
Substrate
Meas. Tech.
ChEMBL_1866003 (CHEMBL4366978)
Ki
3100±n/a nM
Citation
 Heim, CPliatsika, DMousavizadeh, FBär, KHernandez Alvarez, BGiannis, AHartmann, MD De-Novo Design of Cereblon (CRBN) Effectors Guided by Natural Hydrolysis Products of Thalidomide Derivatives. J Med Chem 62:6615-6629 (2019)  
Target
Name:
Cereblon isoform 4
Synonyms:
Cereblon isoform 4
Type:
PROTEIN
Mol. Mass.:
13620.40
Organism:
Magnetospirillum gryphiswaldense
Description:
ChEMBL_116733
Residue:
124
  
Inhibitor
Name:
BDBM65454
Synonyms:
191732-72-6 Lenalidomide Revlimid US9694015, 6.1
Type:
Small organic molecule
Emp. Form.:
C13H13N3O3
Mol. Mass.:
259.2606
SMILES:
Nc1cccc2C(=O)N(Cc12)C1CCC(=O)NC1=O
: