Target
Dihydroorotate dehydrogenase (quinone), mitochondrial
Ligand
BDBM50054601
Substrate
Meas. Tech.
ChEBML_52886
IC50
10000±n/a nM
Citation
 Albert, RKnecht, HAndersen, EHungerford, VSchreier, MHPapageorgiou, C Isoxazolylthioamides as potential immunosuppressants a combinatorial chemistry approach. Bioorg Med Chem Lett 8:2203-8 (1999)  
Target
Name:
Dihydroorotate dehydrogenase (quinone), mitochondrial
Synonyms:
DHODH Dihydroorotate dehydrogenase Dihydroorotate dehydrogenase, mitochondrial Dihydroorotate oxidase (DHODH) | PYRD_HUMAN
Type:
Enzyme
Mol. Mass.:
42881.33
Organism:
Homo sapiens (Human)
Description:
Q02127
Residue:
395
  
Inhibitor
Name:
BDBM50054601
Synonyms:
5-Methyl-N-(4-(trifluoromethyl)phenyl)-4-isoxazolecarboxamide 5-methyl-N-[4-(trifluoromethyl)phenyl]-1,2-oxazole-4-carboxamide CHEMBL960 alpha,alpha,alpha-Trifluoro-5-methyl-4-isoxazolecarboxy-p-toluidide
Type:
Small organic molecule
Emp. Form.:
C12H9F3N2O2
Mol. Mass.:
270.2073
SMILES:
Cc1oncc1C(=O)Nc1ccc(cc1)C(F)(F)F
: