Target
Metabotropic glutamate receptor 2
Ligand
BDBM50072176
Substrate
Meas. Tech.
ChEMBL_104629 (CHEMBL715576)
IC50
1670±n/a nM
Citation
 Collado, IEzquerra, JMazón, APedregal, CYruretagoyena, BKingston, AETomlinson, RWright, RAJohnson, BGSchoepp, DD 2,3'-disubstituted-2-(2'-carboxycyclopropyl)glycines as potent and selective antagonists of metabotropic glutamate receptors. Bioorg Med Chem Lett 8:2849-54 (1999)  
Target
Name:
Metabotropic glutamate receptor 2
Synonyms:
GRM2_RAT Grm2 | Mglur2
Type:
PROTEIN
Mol. Mass.:
95786.41
Organism:
Rattus norvegicus
Description:
ChEMBL_105034
Residue:
872
  
Inhibitor
Name:
BDBM50072176
Synonyms:
(1S,2S,3S)-2-[1-Amino-1-carboxy-2-(9H-xanthen-9-yl)-ethyl]-3-phenethyl-cyclopropanecarboxylic acid | CHEMBL319279
Type:
Small organic molecule
Emp. Form.:
C28H27NO5
Mol. Mass.:
457.5177
SMILES:
NC(CC1c2ccccc2Oc2ccccc12)([C@H]1[C@H](CCc2ccccc2)[C@@H]1C(O)=O)C(O)=O
: