Target
Mitogen-activated protein kinase 1
Ligand
BDBM50338038
Substrate
Meas. Tech.
ChEMBL_1869959 (CHEMBL4371126)
IC50
5.8±n/a nM
Citation
 Meanwell, NA Fluorine and Fluorinated Motifs in the Design and Application of Bioisosteres for Drug Design. J Med Chem 61:5822-5880 (2018)  
Target
Name:
Mitogen-activated protein kinase 1
Synonyms:
ERK2 Extracellular signal-regulated kinase 2 Extracellular signal-regulated kinase 2 (ERK2) MAPK 2 MK01_HUMAN Mitogen-activated protein kinase 1 (ERK-2) Mitogen-activated protein kinase 2 PRKM2 | p42-MAPK
Type:
Ser/Thr Protein Kinase
Mol. Mass.:
41392.76
Organism:
Homo sapiens (Human)
Description:
P28482
Residue:
360
  
Inhibitor
Name:
BDBM50338038
Synonyms:
3,4-difluoro-2-(2-fluoro-4-iodophenylamino)-N-(2-hydroxyethoxy)-5-((3-oxomorpholino)methyl)benzamide CHEMBL1614766 | US8575391, 334
Type:
Small organic molecule
Emp. Form.:
C20H19F3IN3O5
Mol. Mass.:
565.2816
SMILES:
OCCONC(=O)c1cc(CN2OCCCC2=O)c(F)c(F)c1Nc1ccc(I)cc1F
: