Target
Alpha-1,6-mannosyl-glycoprotein 2-beta-N-acetylglucosaminyltransferase
Ligand
BDBM247150
Substrate
Meas. Tech.
ChEMBL_1870514 (CHEMBL4371681)
IC50
0.200000±n/a nM
Citation
 Devasthale, PCheng, D Monoacylglycerol Acyltransferase 2 (MGAT2) Inhibitors for the Treatment of Metabolic Diseases and Nonalcoholic Steatohepatitis (NASH). J Med Chem 61:9879-9888 (2018)  
Target
Name:
Alpha-1,6-mannosyl-glycoprotein 2-beta-N-acetylglucosaminyltransferase
Synonyms:
2.4.1.143 GNT-II MGAT2 Mannoside acetylglucosaminyltransferase 2 Monoacylglycerol acyltransferase type 2 (h-MGAT2) h-MGAT2 (human monoacylglycerol acyltransferase type 2)
Type:
Mol. Mass.:
51567.80
Organism:
Homo sapiens (Human)
Description:
Q10469
Residue:
447
  
Inhibitor
Name:
BDBM247150
Synonyms:
(S,E)-2-Methyl-N-(2,2,2-trifluoro-1-(4-((5,5,5-trifluoropentyl)oxy phenyl)ethylidene)propane-2-sulfinamide US9701672, 54
Type:
Small organic molecule
Emp. Form.:
C24H20F7N5O2S
Mol. Mass.:
575.502
SMILES:
Fc1cc(OCCCC(F)(F)F)ccc1[C@@]1(CC(c2ccc(s2)C2CC2)=C(c2nnn[nH]2)C(=O)N1)C(F)(F)F
: