Target
Oxytocin receptor
Ligand
BDBM50029649
Substrate
Meas. Tech.
ChEBML_193005
Ki
19±n/a nM
Citation
 Kuo, MSBock, MGFreidinger, RMGuidotti, MTLis, EVPawluczyk, JMPerlow, DSPettibone, DJQuigley, AGReiss, DRWilliams, PDWoyden, CJ Nonpeptide oxytocin antagonists: potent, orally bioavailable analogs of L-371,257 containing a 1-R-(pyridyl)ethyl ether terminus. Bioorg Med Chem Lett 8:3081-6 (1999)  
Target
Name:
Oxytocin receptor
Synonyms:
OT-R Otr Oxytocin
Type:
Enzyme Catalytic Domain
Mol. Mass.:
42889.28
Organism:
RAT
Description:
Oxytocin OXTR RAT::P70536
Residue:
388
  
Inhibitor
Name:
BDBM50029649
Synonyms:
1-(1-(4-(1-acetylpiperidin-4-yloxy)-2-methoxybenzoyl)piperidin-4-yl)-1H-benzo[d][1,3]oxazin-2(4H)-one CHEMBL24781 | L-371257
Type:
Small organic molecule
Emp. Form.:
C28H33N3O6
Mol. Mass.:
507.5781
SMILES:
COc1cc(OC2CCN(CC2)C(C)=O)ccc1C(=O)N1CCC(CC1)N1C(=O)OCc2ccccc12
: