Target
Prothrombin
Ligand
BDBM50072527
Substrate
Meas. Tech.
ChEBML_225581
Ki
0.500000±n/a nM
Citation
 St-Denis, YAugelli-Szafran, CEBachand, BBerryman, KADiMaio, JDoherty, AMEdmunds, JJLeblond, LLévesque, SNarasimhan, LSPenvose-Yi, JRRubin, JRTarazi, MWinocour, PDSiddiqui, MA Potent bicyclic lactam inhibitors of thrombin: Part I: P3 modifications. Bioorg Med Chem Lett 8:3193-8 (1999)  
Target
Name:
Prothrombin
Synonyms:
Activation peptide fragment 1 Coagulation factor II Prothrombin precursor Thrombin heavy chain | Thrombin light chain
Type:
Protein
Mol. Mass.:
70029.57
Organism:
Homo sapiens (Human)
Description:
P00734
Residue:
622
  
Inhibitor
Name:
BDBM50072527
Synonyms:
(6S,8aS)-4-Oxo-2-(3-p-tolyl-propionyl)-octahydro-pyrrolo[1,2-a]pyrazine-6-carboxylic acid [4-guanidino-1-(thiazole-2-carbonyl)-butyl]-amide | CHEMBL107507
Type:
Small organic molecule
Emp. Form.:
C27H35N7O4S
Mol. Mass.:
553.676
SMILES:
Cc1ccc(CCC(=O)N2C[C@@H]3CC[C@H](N3C(=O)C2)C(=O)NC(CCCNC(N)=N)C(=O)c2nccs2)cc1
: