Target
Prothrombin
Ligand
BDBM50072535
Substrate
Meas. Tech.
ChEBML_225581
Ki
5±n/a nM
Citation
 St-Denis, YAugelli-Szafran, CEBachand, BBerryman, KADiMaio, JDoherty, AMEdmunds, JJLeblond, LLévesque, SNarasimhan, LSPenvose-Yi, JRRubin, JRTarazi, MWinocour, PDSiddiqui, MA Potent bicyclic lactam inhibitors of thrombin: Part I: P3 modifications. Bioorg Med Chem Lett 8:3193-8 (1999)  
Target
Name:
Prothrombin
Synonyms:
Activation peptide fragment 1 Coagulation factor II Prothrombin precursor Thrombin heavy chain | Thrombin light chain
Type:
Protein
Mol. Mass.:
70029.57
Organism:
Homo sapiens (Human)
Description:
P00734
Residue:
622
  
Inhibitor
Name:
BDBM50072535
Synonyms:
(6S,8aS)-4-Oxo-2-(3-phenoxy-propionyl)-octahydro-pyrrolo[1,2-a]pyrazine-6-carboxylic acid [4-guanidino-1-(thiazole-2-carbonyl)-butyl]-amide | CHEMBL109456
Type:
Small organic molecule
Emp. Form.:
C26H33N7O5S
Mol. Mass.:
555.649
SMILES:
NC(=N)NCCCC(NC(=O)[C@@H]1CC[C@H]2CN(CC(=O)N12)C(=O)CCOc1ccccc1)C(=O)c1nccs1
: