Target
Prothrombin
Ligand
BDBM50072741
Substrate
Meas. Tech.
ChEBML_225420
IC50
1±n/a nM
Citation
 Plummer, JSBerryman, KACai, CCody, WLDiMaio, JDoherty, AMEdmunds, JJHe, JXHolland, DRLevesque, SKent, DRNarasimhan, LSRubin, JRRapundalo, STSiddiqui, MASusser, AJSt-Denis, YWinocour, PD Potent and selective bicyclic lactam inhibitors of thrombin: Part 2: P1 modifications. Bioorg Med Chem Lett 8:3409-14 (1999)  
Target
Name:
Prothrombin
Synonyms:
Activation peptide fragment 1 Coagulation factor II Prothrombin precursor Thrombin heavy chain | Thrombin light chain
Type:
Protein
Mol. Mass.:
70029.57
Organism:
Homo sapiens (Human)
Description:
P00734
Residue:
622
  
Inhibitor
Name:
BDBM50072741
Synonyms:
(6S,8aS)-4-Oxo-2-(3-phenyl-propionyl)-octahydro-pyrrolo[1,2-a]pyrazine-6-carboxylic acid [(S)-1-(1-carbamimidoyl-piperidin-4-yl)-2-oxo-2-thiazol-2-yl-ethyl]-amide CHEMBL333154
Type:
Small organic molecule
Emp. Form.:
C28H35N7O4S
Mol. Mass.:
565.687
SMILES:
NC(=N)N1CCC(CC1)[C@H](NC(=O)[C@@H]1CC[C@H]2CN(CC(=O)N12)C(=O)CCc1ccccc1)C(=O)c1nccs1
: