Target
5-hydroxytryptamine receptor 1A
Ligand
BDBM50072747
Substrate
Meas. Tech.
ChEBML_202316
Ki
156±n/a nM
Citation
 Perez, MPauwels, PJPallard-Sigogneau, IFourrier, CChopin, PPalmier, CColovray, VHalazy, S Design and synthesis of new potent, silent 5-HT1A antagonists by covalent coupling of aminopropanol derivatives with selective serotonin reuptake inhibitors. Bioorg Med Chem Lett 8:3423-8 (1999)  
Target
Name:
5-hydroxytryptamine receptor 1A
Synonyms:
5-HT-1A 5-hydroxytryptamine receptor 1A (5-HT-1A) ADRB2RL1 Dopamine D2 receptor and serotonin 1a receptor HTR1A | Serotonin receptor 1A
Type:
Mol. Mass.:
46122.49
Organism:
Homo sapiens (Human)
Description:
Residue:
422
  
Inhibitor
Name:
BDBM50072747
Synonyms:
1-{6-[(3R,4S)-3-(Benzo[1,3]dioxol-5-yloxymethyl)-4-(4-fluoro-phenyl)-piperidin-1-yl]-hexylamino}-3-(naphthalen-1-yloxy)-propan-2-ol | CHEMBL116444
Type:
Small organic molecule
Emp. Form.:
C38H45FN2O5
Mol. Mass.:
628.7727
SMILES:
OC(CNCCCCCCN1CC[C@@H]([C@@H](COc2ccc3OCOc3c2)C1)c1ccc(F)cc1)COc1cccc2ccccc12
: