Target
Cannabinoid receptor 1
Ligand
BDBM50072769
Substrate
Meas. Tech.
ChEMBL_46802 (CHEMBL659689)
Ki
5.3±n/a nM
Citation
 Lin, SKhanolkar, ADFan, PGoutopoulos, AQin, CPapahadjis, DMakriyannis, A Novel analogues of arachidonylethanolamide (anandamide): affinities for the CB1 and CB2 cannabinoid receptors and metabolic stability. J Med Chem 41:5353-61 (1999)  
Target
Name:
Cannabinoid receptor 1
Synonyms:
Brain-type cannabinoid receptor CB-R CNR1_RAT Cannabinoid receptor Cnr1 | Skr6
Type:
G Protein-Coupled Receptor (GPCR)
Mol. Mass.:
52856.55
Organism:
Rattus norvegicus (rat)
Description:
P20272
Residue:
473
  
Inhibitor
Name:
BDBM50072769
Synonyms:
(5Z,8Z,11Z,14Z)-Icosa-5,8,11,14-tetraenoic acid (2-chloro-ethyl)-amide CHEMBL151167 | N-(2-chloroethyl)icosa-5,8,11,14-tetraenamide
Type:
Small organic molecule
Emp. Form.:
C22H36ClNO
Mol. Mass.:
365.98
SMILES:
CCCCC\C=C/C\C=C/C\C=C/C\C=C/CCCC(=O)NCCCl
: