Target
Sodium channel protein type 9 subunit alpha
Ligand
BDBM50240277
Substrate
Meas. Tech.
ChEMBL_1872078 (CHEMBL4373245)
IC50
3.9±n/a nM
Citation
 Luo, GChen, LEaston, ANewton, ABourin, CShields, EMosure, KSoars, MGKnox, RJMatchett, MPieschl, RLPost-Munson, DJWang, SHerrington, JGraef, JNewberry, KSivarao, DVSenapati, ABristow, LJMeanwell, NAThompson, LADzierba, C Discovery of Indole- and Indazole-acylsulfonamides as Potent and Selective Na J Med Chem 62:831-856 (2019)  
Target
Name:
Sodium channel protein type 9 subunit alpha
Synonyms:
Kiaa4197 Peripheral sodium channel 1 Scn9a Sodium channel protein type IX subunit alpha | Voltage-gated sodium channel subunit alpha Nav1.7
Type:
PROTEIN
Mol. Mass.:
225808.99
Organism:
Mus musculus
Description:
ChEMBL_109594
Residue:
1984
  
Inhibitor
Name:
BDBM50240277
Synonyms:
CHEMBL4061793
Type:
Small organic molecule
Emp. Form.:
C17H20ClFN4O2S2
Mol. Mass.:
430.948
SMILES:
Fc1cc(NCC23CCCN2CCC3)c(Cl)cc1S(=O)(=O)Nc1nccs1
: