Target
Sodium channel protein type 9 subunit alpha
Ligand
BDBM50465061
Substrate
Meas. Tech.
ChEMBL_1872089 (CHEMBL4373256)
IC50
5.0±n/a nM
Citation
 Luo, GChen, LEaston, ANewton, ABourin, CShields, EMosure, KSoars, MGKnox, RJMatchett, MPieschl, RLPost-Munson, DJWang, SHerrington, JGraef, JNewberry, KSivarao, DVSenapati, ABristow, LJMeanwell, NAThompson, LADzierba, C Discovery of Indole- and Indazole-acylsulfonamides as Potent and Selective Na J Med Chem 62:831-856 (2019)  
Target
Name:
Sodium channel protein type 9 subunit alpha
Synonyms:
Kiaa4197 Peripheral sodium channel 1 Scn9a Sodium channel protein type IX subunit alpha | Voltage-gated sodium channel subunit alpha Nav1.7
Type:
PROTEIN
Mol. Mass.:
225808.99
Organism:
Mus musculus
Description:
ChEMBL_109594
Residue:
1984
  
Inhibitor
Name:
BDBM50465061
Synonyms:
CHEMBL4290933 | US10550080, Example 47
Type:
Small organic molecule
Emp. Form.:
C20H16F4N2O3S
Mol. Mass.:
440.411
SMILES:
Cn1cc(-c2ccc(cc2)C(F)(F)F)c2cc(F)c(cc12)C(=O)NS(=O)(=O)C1CC1
: