Target
Beta-lactamase TEM
Ligand
BDBM50518879
Substrate
Meas. Tech.
ChEMBL_1873666 (CHEMBL4374955)
Ki
2030±n/a nM
Citation
 Wang, YLLiu, SYu, ZJLei, YHuang, MYYan, YHMa, QZheng, YDeng, HSun, YWu, CYu, YChen, QWang, ZWu, YLi, GB Structure-Based Development of (1-(3'-Mercaptopropanamido)methyl)boronic Acid Derived Broad-Spectrum, Dual-Action Inhibitors of Metallo- and Serine-?-lactamases. J Med Chem 62:7160-7184 (2019)  
Target
Name:
Beta-lactamase TEM
Synonyms:
BLAT_ECOLX Beta-lactamase (TEM-1) Beta-lactamase TEM-1 Beta-lactamase TEM1D Beta-lactamase TEM1F TEM extended-spectrum beta-lactamase bla
Type:
Enzyme
Mol. Mass.:
31512.33
Organism:
Escherichia coli
Description:
P62593
Residue:
286
  
Inhibitor
Name:
BDBM50518879
Synonyms:
CHEMBL4450911
Type:
Small organic molecule
Emp. Form.:
C15H18BNO3S
Mol. Mass.:
303.184
SMILES:
C[C@H](CS)C(=O)N[C@H](B(O)O)c1ccc2ccccc2c1
: