Target
Gag-Pol polyprotein [489-587]
Ligand
BDBM1676
Substrate
Meas. Tech.
ChEMBL_157551 (CHEMBL763303)
Ki
3±n/a nM
Citation
 Debnath, AK Three-dimensional quantitative structure-activity relationship study on cyclic urea derivatives as HIV-1 protease inhibitors: application of comparative molecular field analysis. J Med Chem 42:249-59 (1999)  
Target
Name:
Gag-Pol polyprotein [489-587]
Synonyms:
Human immunodeficiency virus type 1 protease Pol polyprotein | gag-pol
Type:
Enzyme Subunit
Mol. Mass.:
10781.16
Organism:
Human immunodeficiency virus type 1
Description:
P04585[489-587]
Residue:
99
  
Inhibitor
Name:
BDBM1676
Synonyms:
(4R,5S,6S,7R)-1,3,4,7-tetrabenzyl-5,6-dihydroxy-1,3-diazepan-2-one Cyclic Urea Based HIV-1 Protease Inhibitor 1 (parent)
Type:
Small organic molecule
Emp. Form.:
C33H34N2O3
Mol. Mass.:
506.6347
SMILES:
O[C@@H]1[C@@H](O)[C@@H](Cc2ccccc2)N(Cc2ccccc2)C(=O)N(Cc2ccccc2)[C@@H]1Cc1ccccc1
: