Target
Gag-Pol polyprotein [489-587]
Ligand
BDBM50073095
Substrate
Meas. Tech.
ChEMBL_157551 (CHEMBL763303)
Ki
0.012±n/a nM
Citation
 Debnath, AK Three-dimensional quantitative structure-activity relationship study on cyclic urea derivatives as HIV-1 protease inhibitors: application of comparative molecular field analysis. J Med Chem 42:249-59 (1999)  
Target
Name:
Gag-Pol polyprotein [489-587]
Synonyms:
Human immunodeficiency virus type 1 protease Pol polyprotein | gag-pol
Type:
Enzyme Subunit
Mol. Mass.:
10781.16
Organism:
Human immunodeficiency virus type 1
Description:
P04585[489-587]
Residue:
99
  
Inhibitor
Name:
BDBM50073095
Synonyms:
3-[(4R,5S,6S,7R)-3-(3-Amino-phenyl)-4,7-dibenzyl-5,6-dihydroxy-2-oxo-[1,3]diazepan-1-ylmethyl]-N-(1H-imidazol-2-yl)-benzamide | CHEMBL313348
Type:
Small organic molecule
Emp. Form.:
C36H36N6O4
Mol. Mass.:
616.7088
SMILES:
Nc1cccc(c1)N1[C@H](Cc2ccccc2)[C@H](O)[C@@H](O)[C@@H](Cc2ccccc2)N(Cc2cccc(c2)C(=O)Nc2ncc[nH]2)C1=O
: