Target
Short transient receptor potential channel 5
Ligand
BDBM7462
Substrate
Meas. Tech.
ChEMBL_1875698 (CHEMBL4377092)
IC50
3900±n/a nM
Citation
 Sharma, SHopkins, CR Review of Transient Receptor Potential Canonical (TRPC5) Channel Modulators and Diseases. J Med Chem 62:7589-7602 (2019)  
Target
Name:
Short transient receptor potential channel 5
Synonyms:
TRP5 TRPC5_HUMAN | Transient receptor protein 5 (TRPC5)
Type:
Enzyme
Mol. Mass.:
111421.47
Organism:
Homo sapiens (Human)
Description:
Q9UL62
Residue:
973
  
Inhibitor
Name:
BDBM7462
Synonyms:
3,5,7-trihydroxy-2-(4-hydroxyphenyl)-4H-chromen-4-one CHEMBL150 Kaempferol (Kmp) kaempferol
Type:
Small organic molecule
Emp. Form.:
C15H10O6
Mol. Mass.:
286.2363
SMILES:
Oc1ccc(cc1)-c1oc2cc(O)cc(O)c2c(=O)c1O
: