Target
Alpha-1B adrenergic receptor
Ligand
BDBM50073566
Substrate
Meas. Tech.
ChEMBL_32304 (CHEMBL646250)
Ki
9.05±n/a nM
Citation
 Leonardi, AMotta, GBoi, CTesta, RPoggesi, EDe Benedetti, PGMenziani, MC Synthesis, pharmacological evaluation, and structure-activity relationship and quantitative structure-activity relationship studies on novel derivatives of 2,4-diamino-6,7-dimethoxyquinazoline alpha1-adrenoceptor antagonists. J Med Chem 42:427-37 (1999)  
Target
Name:
Alpha-1B adrenergic receptor
Synonyms:
ADA1B_HUMAN Adrenergic alpha1B Adrenergic receptor alpha Alpha 1B-adrenoreceptor | Alpha-1B adrenergic receptor
Type:
Enzyme
Mol. Mass.:
56862.13
Organism:
Homo sapiens (Human)
Description:
P35368
Residue:
520
  
Inhibitor
Name:
BDBM50073566
Synonyms:
1-[4-(4-Amino-6,7-dimethoxy-quinazolin-2-yl)-piperazin-1-yl]-2-(2,6-dimethoxy-phenoxy)-ethanone | CHEMBL335731
Type:
Small organic molecule
Emp. Form.:
C24H29N5O6
Mol. Mass.:
483.517
SMILES:
COc1cccc(OC)c1OCC(=O)N1CCN(CC1)c1nc(N)c2cc(OC)c(OC)cc2n1
: