Target
5-hydroxytryptamine receptor 2A
Ligand
BDBM50073581
Substrate
Meas. Tech.
ChEMBL_2589 (CHEMBL617457)
IC50
>1000±n/a nM
Citation
 Leonardi, AMotta, GBoi, CTesta, RPoggesi, EDe Benedetti, PGMenziani, MC Synthesis, pharmacological evaluation, and structure-activity relationship and quantitative structure-activity relationship studies on novel derivatives of 2,4-diamino-6,7-dimethoxyquinazoline alpha1-adrenoceptor antagonists. J Med Chem 42:427-37 (1999)  
Target
Name:
5-hydroxytryptamine receptor 2A
Synonyms:
5-HT-2A 5-HT2A 5-hydroxytryptamine receptor 2A (5HT2A) Htr2 Serotonin Receptor 2A
Type:
G Protein-Coupled Receptor (GPCR)
Mol. Mass.:
52852.05
Organism:
Rattus norvegicus (rat)
Description:
Rat cortex membranes 5-HT2A receptors.
Residue:
471
  
Inhibitor
Name:
BDBM50073581
Synonyms:
1-[4-(4-Amino-6,7-dimethoxy-quinazolin-2-yl)-piperazin-1-yl]-2-(2-methoxy-phenoxy)-2-methyl-propan-1-one | CHEMBL137679
Type:
Small organic molecule
Emp. Form.:
C25H31N5O5
Mol. Mass.:
481.5441
SMILES:
COc1ccccc1OC(C)(C)C(=O)N1CCN(CC1)c1nc(N)c2cc(OC)c(OC)cc2n1
: