Target
Leukotriene C4 synthase
Ligand
BDBM50052024
Substrate
Meas. Tech.
ChEMBL_1876828 (CHEMBL4378222)
IC50
<5000±n/a nM
Target
Name:
Leukotriene C4 synthase
Synonyms:
LTC4 synthase LTC4S_HUMAN | Leukotriene-C(4) synthase
Type:
PROTEIN
Mol. Mass.:
16575.59
Organism:
Homo sapiens (Human)
Description:
ChEMBL_961179
Residue:
150
  
Inhibitor
Name:
BDBM50052024
Synonyms:
CHEMBL787 | montelukast
Type:
Small organic molecule
Emp. Form.:
C35H36ClNO3S
Mol. Mass.:
586.183
SMILES:
CC(C)(O)c1ccccc1CC[C@@H](SCC1(CC(O)=O)CC1)c1cccc(\C=C\c2ccc3ccc(Cl)cc3n2)c1
: