Target
D(2) dopamine receptor
Ligand
BDBM50073614
Substrate
Meas. Tech.
ChEMBL_61419 (CHEMBL675887)
IC50
150±n/a nM
Citation
 Perrone, RBerardi, FColabufo, NALeopoldo, MTortorella, V 1-aryl-4-[(5-methoxy-1,2,3, 4-tetrahydronaphthalen-1-yl)alkyl]piperazines and their analogues: influence of the stereochemistry of the tetrahydronaphthalen-1-yl nucleus on 5-HT1A receptor affinity and selectivity versus alpha1 and D2 receptors. 5. J Med Chem 42:490-6 (1999)  
Target
Name:
D(2) dopamine receptor
Synonyms:
DOPAMINE D2 DOPAMINE D2 Short Dopamine D2 receptor Drd2
Type:
G Protein-Coupled Receptor (GPCR)
Mol. Mass.:
50931.60
Organism:
Rattus norvegicus (rat)
Description:
P61169
Residue:
444
  
Inhibitor
Name:
BDBM50073614
Synonyms:
1-(2-Methoxy-phenyl)-4-[3-((R)-5-methoxy-1,2,3,4-tetrahydro-naphthalen-1-yl)-propyl]-piperazine | CHEMBL144523
Type:
Small organic molecule
Emp. Form.:
C25H34N2O2
Mol. Mass.:
394.5497
SMILES:
COc1cccc2[C@@H](CCCN3CCN(CC3)c3ccccc3OC)CCCc12
: