Target
5-hydroxytryptamine receptor 1A
Ligand
BDBM50033839
Substrate
Meas. Tech.
ChEMBL_846 (CHEMBL615902)
IC50
0.77±n/a nM
Citation
 Perrone, RBerardi, FColabufo, NALeopoldo, MTortorella, V 1-aryl-4-[(5-methoxy-1,2,3, 4-tetrahydronaphthalen-1-yl)alkyl]piperazines and their analogues: influence of the stereochemistry of the tetrahydronaphthalen-1-yl nucleus on 5-HT1A receptor affinity and selectivity versus alpha1 and D2 receptors. 5. J Med Chem 42:490-6 (1999)  
Target
Name:
5-hydroxytryptamine receptor 1A
Synonyms:
5-HT-1A 5-HT1A 5-hydroxytryptamine receptor 1A (5HT1A) 5ht1a Htr1a Serotonin 1a (5-HT1a) receptor/Adrenergic receptor alpha-1 | Serotonin receptor 1A
Type:
G Protein-Coupled Receptor (GPCR)
Mol. Mass.:
46445.29
Organism:
Rattus norvegicus (rat)
Description:
Binding assays were performed using rat hippocampal membranes.
Residue:
422
  
Inhibitor
Name:
BDBM50033839
Synonyms:
1-(2-Methoxy-phenyl)-4-[3-(5-methoxy-1,2,3,4-tetrahydro-naphthalen-1-yl)-propyl]-piperazine | CHEMBL26929
Type:
Small organic molecule
Emp. Form.:
C25H34N2O2
Mol. Mass.:
394.5497
SMILES:
COc1cccc2C(CCCN3CCN(CC3)c3ccccc3OC)CCCc12
: