Target
ALK tyrosine kinase receptor
Ligand
BDBM50519598
Substrate
Meas. Tech.
ChEMBL_1876849 (CHEMBL4378243)
Ki
0.700000±n/a nM
Citation
 Kong, XPan, PSun, HXia, HWang, XLi, YHou, T Drug Discovery Targeting Anaplastic Lymphoma Kinase (ALK). J Med Chem 62:10927-10954 (2019)  
Target
Name:
ALK tyrosine kinase receptor
Synonyms:
ALK ALK_HUMAN CD_antigen: CD246
Type:
Protein
Mol. Mass.:
176453.10
Organism:
Homo sapiens (Human)
Description:
Q9UM73
Residue:
1620
  
Inhibitor
Name:
BDBM50519598
Synonyms:
CHEMBL4436406
Type:
Small organic molecule
Emp. Form.:
C22H21FN6O2
Mol. Mass.:
420.4395
SMILES:
C[C@H]1Oc2cc(Cc3c(CN(C)C(=O)c4ccc(F)cc14)nn(C)c3C#N)cnc2N
: