Target
Proto-oncogene tyrosine-protein kinase ROS
Ligand
BDBM50519598
Substrate
Meas. Tech.
ChEMBL_1876851 (CHEMBL4378245)
Ki
<0.070000±n/a nM
Citation
 Kong, XPan, PSun, HXia, HWang, XLi, YHou, T Drug Discovery Targeting Anaplastic Lymphoma Kinase (ALK). J Med Chem 62:10927-10954 (2019)  
Target
Name:
Proto-oncogene tyrosine-protein kinase ROS
Synonyms:
MCF3 Proto-oncogene c-Ros-1 ROS1 Receptor tyrosine kinase c-ros oncogene 1 c-Ros receptor tyrosine kinase
Type:
Enzyme
Mol. Mass.:
263897.39
Organism:
Homo sapiens (Human)
Description:
P08922
Residue:
2347
  
Inhibitor
Name:
BDBM50519598
Synonyms:
CHEMBL4436406
Type:
Small organic molecule
Emp. Form.:
C22H21FN6O2
Mol. Mass.:
420.4395
SMILES:
C[C@H]1Oc2cc(Cc3c(CN(C)C(=O)c4ccc(F)cc14)nn(C)c3C#N)cnc2N
: