Target
5-hydroxytryptamine receptor 1D
Ligand
BDBM50073682
Substrate
Meas. Tech.
ChEMBL_1728 (CHEMBL616933)
Ki
2.3±n/a nM
Citation
 Xu, YCSchaus, JMWalker, CKrushinski, JAdham, NZgombick, JMLiang, SXKohlman, DTAudia, JE N-Methyl-5-tert-butyltryptamine: A novel, highly potent 5-HT1D receptor agonist. J Med Chem 42:526-31 (1999)  
Target
Name:
5-hydroxytryptamine receptor 1D
Synonyms:
5-HT-1D 5-HT1D 5HT1D_HUMAN HTR1DA Serotonin (5-HT) receptor | Serotonin Receptor 1D
Type:
G Protein-Coupled Receptor (GPCR)
Mol. Mass.:
41920.63
Organism:
Homo sapiens (Human)
Description:
Receptor binding assays were performed using human clone stably expressed in CHO cells.
Residue:
377
  
Inhibitor
Name:
BDBM50073682
Synonyms:
CHEMBL1278 N-methyl-2-[3-(1-methyl-4-piperidyl)-1H-indol-5-yl]-ethanesulfonamide NARATRIPTAN
Type:
Small organic molecule
Emp. Form.:
C17H25N3O2S
Mol. Mass.:
335.464
SMILES:
CNS(=O)(=O)CCc1ccc2[nH]cc(C3CCN(C)CC3)c2c1
: