Target
5-hydroxytryptamine receptor 1B
Ligand
BDBM50005835
Substrate
Meas. Tech.
ChEMBL_1357 (CHEMBL616430)
Ki
9.6±n/a nM
Citation
 Xu, YCSchaus, JMWalker, CKrushinski, JAdham, NZgombick, JMLiang, SXKohlman, DTAudia, JE N-Methyl-5-tert-butyltryptamine: A novel, highly potent 5-HT1D receptor agonist. J Med Chem 42:526-31 (1999)  
Target
Name:
5-hydroxytryptamine receptor 1B
Synonyms:
5-HT-1B 5-HT1B 5HT1B_HUMAN HTR1DB Serotonin (5-HT) receptor Serotonin Receptor 1B
Type:
G Protein-Coupled Receptor (GPCR)
Mol. Mass.:
43579.17
Organism:
Homo sapiens (Human)
Description:
Receptor binding assays were performed using human clone stably expressed in CHO cells
Residue:
390
  
Inhibitor
Name:
BDBM50005835
Synonyms:
(3-[2-(dimethylamino)ethyl]-1H-indol-5-yl)-N-methylmethanesulfonamide 1-{3-[2-(dimethylamino)ethyl]-1H-indol-5-yl}-N-methylmethanesulfonamide 3-[2-(dimethylamino)ethyl]-N-methylindole-5-methanesulfonamide SUMATRIPTAN Sumax
Type:
Small organic molecule
Emp. Form.:
C14H21N3O2S
Mol. Mass.:
295.4
SMILES:
CNS(=O)(=O)Cc1ccc2[nH]cc(CCN(C)C)c2c1
: