Target
Cytochrome P450 3A4
Ligand
BDBM50121975
Substrate
Meas. Tech.
ChEMBL_1877247 (CHEMBL4378641)
IC50
28000±n/a nM
Citation
 Chatzopoulou, MClaridge, TDWDavies, KEDavies, SGElsey, DJEmer, EFletcher, AMHarriman, SRobinson, NRowley, JARussell, AJTinsley, JMWeaver, RWilkinson, IVLWillis, NJWilson, FXWynne, GM Isolation, Structural Identification, Synthesis, and Pharmacological Profiling of 1,2- J Med Chem 63:2547-2556 (2020)  
Target
Name:
Cytochrome P450 3A4
Synonyms:
Albendazole monooxygenase CP3A4_HUMAN CYP3A4 CYPIIIA4 Cytochrome P450 3A4 (CYP3A4) Nifedipine oxidase Taurochenodeoxycholate 6-alpha-hydroxylase
Type:
Enzyme
Mol. Mass.:
57349.57
Organism:
Homo sapiens (Human)
Description:
Residue:
503
  
Inhibitor
Name:
BDBM50121975
Synonyms:
(6-Methoxy-quinolin-4-yl)-(5-vinyl-1-aza-bicyclo[2.2.2]oct-2-yl)-methanol CHEMBL1294 DURAQUIN QUINAGLUTE QUINATIME QUINIDINE US9402878, Quinidine
Type:
Small organic molecule
Emp. Form.:
C20H24N2O2
Mol. Mass.:
324.4168
SMILES:
COc1ccc2nccc([C@H](O)[C@H]3C[C@@H]4CCN3C[C@@H]4C=C)c2c1
: