Target
D(2) dopamine receptor
Ligand
BDBM50060601
Substrate
Meas. Tech.
ChEMBL_58613 (CHEMBL666183)
Ki
60±n/a nM
Citation
 Khalil, EMOjala, WHPradhan, ANair, VDGleason, WBMishra, RKJohnson, RL Design, synthesis, and dopamine receptor modulating activity of spiro bicyclic peptidomimetics of L-prolyl-L-leucyl-glycinamide. J Med Chem 42:628-37 (1999)  
Target
Name:
D(2) dopamine receptor
Synonyms:
D(2) dopamine receptor DOPAMINE D2 Long DRD2 Dopamine D2 receptor Dopamine D2 receptor (D2R) Dopamine2-like | d2
Type:
Cell-surface receptors
Mol. Mass.:
50647.10
Organism:
Homo sapiens (Human)
Description:
P14416
Residue:
443
  
Inhibitor
Name:
BDBM50060601
Synonyms:
(E)-6-(3-oxo-3-phenylprop-1-enyl)pyrimidine-2,4(1H,3H)-dione 6-((E)-3-Oxo-3-phenyl-propenyl)-1H-pyrimidine-2,4-dione L-pro-L-leu-gly-NH2 Pyrrolidine-2-carboxylic acid [1-(carbamoylmethyl-carbamoyl)-3-methyl-butyl]-amide
Type:
Small organic molecule
Emp. Form.:
C13H24N4O3
Mol. Mass.:
284.3547
SMILES:
CC(C)C[C@H](NC(=O)[C@@H]1CCCN1)C(=O)NCC(N)=O
: