Target
Orexin/Hypocretin receptor type 1
Ligand
BDBM50093793
Substrate
Meas. Tech.
ChEMBL_1879202 (CHEMBL4380596)
Ki
2.5±n/a nM
Citation
 Rappas, MAli, AAEBennett, KABrown, JDBucknell, SJCongreve, MCooke, RMCseke, Gde Graaf, CDoré, ASErrey, JCJazayeri, AMarshall, FHMason, JSMould, RPatel, JCTehan, BGWeir, MChristopher, JA Comparison of Orexin 1 and Orexin 2 Ligand Binding Modes Using X-ray Crystallography and Computational Analysis. J Med Chem 63:1528-1543 (2020)  
Target
Name:
Orexin/Hypocretin receptor type 1
Synonyms:
HCRTR1 OX1R_HUMAN Orexin receptor type 1 (OR 1) Orexin receptor type 1 (OX1) Orexin receptor type 1 (OxR1) | Ox1r
Type:
Protein
Mol. Mass.:
47554.50
Organism:
Homo sapiens (Human)
Description:
O43613
Residue:
425
  
Inhibitor
Name:
BDBM50093793
Synonyms:
E-2006 | Lemborexant
Type:
Small organic molecule
Emp. Form.:
C22H20F2N4O2
Mol. Mass.:
410.4166
SMILES:
Cc1ncc(OC[C@]2(C[C@H]2C(=O)Nc2ccc(F)cn2)c2cccc(F)c2)c(C)n1
: