Target
Adenosine receptor A1
Ligand
BDBM50074225
Substrate
Meas. Tech.
ChEMBL_29458 (CHEMBL642187)
Ki
15600±n/a nM
Citation
 Li, AHMoro, SForsyth, NMelman, NJi, XDJacobson, KA Synthesis, CoMFA analysis, and receptor docking of 3,5-diacyl-2, 4-dialkylpyridine derivatives as selective A3 adenosine receptor antagonists. J Med Chem 42:706-21 (1999)  
Target
Name:
Adenosine receptor A1
Synonyms:
AA1R_RAT ADENOSINE A1 high Adenosine A1 receptor (A1) Adenosine receptors A1 | Adora1
Type:
Protein
Mol. Mass.:
36704.13
Organism:
Rattus norvegicus (rat)
Description:
Residue:
326
  
Inhibitor
Name:
BDBM50074225
Synonyms:
6-Ethyl-5-ethylsulfanylcarbonyl-2-phenyl-4-propyl-nicotinic acid propyl ester | CHEMBL111545
Type:
Small organic molecule
Emp. Form.:
C23H29NO3S
Mol. Mass.:
399.546
SMILES:
CCCOC(=O)c1c(CCC)c(C(=O)SCC)c(CC)nc1-c1ccccc1
: