Target
Adenosine receptor A3
Ligand
BDBM50074225
Substrate
Meas. Tech.
ChEMBL_30610 (CHEMBL642017)
Ki
113±n/a nM
Citation
 Li, AHMoro, SForsyth, NMelman, NJi, XDJacobson, KA Synthesis, CoMFA analysis, and receptor docking of 3,5-diacyl-2, 4-dialkylpyridine derivatives as selective A3 adenosine receptor antagonists. J Med Chem 42:706-21 (1999)  
Target
Name:
Adenosine receptor A3
Synonyms:
AA3R_RAT Adenosine receptor A2a and A3 | Adora3
Type:
PROTEIN
Mol. Mass.:
36643.73
Organism:
Rattus norvegicus
Description:
ChEMBL_479910
Residue:
320
  
Inhibitor
Name:
BDBM50074225
Synonyms:
6-Ethyl-5-ethylsulfanylcarbonyl-2-phenyl-4-propyl-nicotinic acid propyl ester | CHEMBL111545
Type:
Small organic molecule
Emp. Form.:
C23H29NO3S
Mol. Mass.:
399.546
SMILES:
CCCOC(=O)c1c(CCC)c(C(=O)SCC)c(CC)nc1-c1ccccc1
: