Target
Adenosine receptor A1
Ligand
BDBM50074210
Substrate
Meas. Tech.
ChEMBL_29458 (CHEMBL642187)
Ki
9800±n/a nM
Citation
 Li, AHMoro, SForsyth, NMelman, NJi, XDJacobson, KA Synthesis, CoMFA analysis, and receptor docking of 3,5-diacyl-2, 4-dialkylpyridine derivatives as selective A3 adenosine receptor antagonists. J Med Chem 42:706-21 (1999)  
Target
Name:
Adenosine receptor A1
Synonyms:
AA1R_RAT ADENOSINE A1 high Adenosine A1 receptor (A1) Adenosine receptors A1 | Adora1
Type:
Protein
Mol. Mass.:
36704.13
Organism:
Rattus norvegicus (rat)
Description:
Residue:
326
  
Inhibitor
Name:
BDBM50074210
Synonyms:
4-(2-Acetylsulfanyl-ethyl)-6-ethyl-5-ethylsulfanylcarbonyl-2-phenyl-nicotinic acid propyl ester | CHEMBL162665
Type:
Small organic molecule
Emp. Form.:
C24H29NO4S2
Mol. Mass.:
459.621
SMILES:
CCCOC(=O)c1c(CCSC(C)=O)c(C(=O)SCC)c(CC)nc1-c1ccccc1
: