Target
Adenosine receptor A2a
Ligand
BDBM50074220
Substrate
Meas. Tech.
ChEMBL_30012 (CHEMBL641303)
Ki
7330±n/a nM
Citation
 Li, AHMoro, SForsyth, NMelman, NJi, XDJacobson, KA Synthesis, CoMFA analysis, and receptor docking of 3,5-diacyl-2, 4-dialkylpyridine derivatives as selective A3 adenosine receptor antagonists. J Med Chem 42:706-21 (1999)  
Target
Name:
Adenosine receptor A2a
Synonyms:
AA2AR_RAT Adenosine A2 receptor Adenosine Receptors A2a (A2a) Adenosine receptors A2a Rat striatal adenosine A2a receptor
Type:
G Protein-Coupled Receptor (GPCR)
Mol. Mass.:
45015.65
Organism:
Rattus norvegicus (rat)
Description:
Rat A2A receptors expressed in CHO cells.
Residue:
410
  
Inhibitor
Name:
BDBM50074220
Synonyms:
4,6-Diethyl-5-ethylsulfanylcarbonyl-2-phenyl-nicotinic acid 2-fluoro-ethyl ester | CHEMBL164321
Type:
Small organic molecule
Emp. Form.:
C21H24FNO3S
Mol. Mass.:
389.484
SMILES:
CCSC(=O)c1c(CC)nc(-c2ccccc2)c(C(=O)OCCF)c1CC
: