Target
ATPase family AAA domain-containing protein 2
Ligand
BDBM50520627
Substrate
Meas. Tech.
ChEMBL_1881390 (CHEMBL4382889)
IC50
166±n/a nM
Citation
 Valeur, EJimonet, P New Modalities, Technologies, and Partnerships in Probe and Lead Generation: Enabling a Mode-of-Action Centric Paradigm. J Med Chem 61:9004-9029 (2018)  
Target
Name:
ATPase family AAA domain-containing protein 2
Synonyms:
AAA nuclear coregulator cancer-associated protein ATAD2 PRO2000
Type:
PROTEIN
Mol. Mass.:
158546.30
Organism:
Homo sapiens (Human)
Description:
ChEMBL_1500426
Residue:
1390
  
Inhibitor
Name:
BDBM50520627
Synonyms:
CHEMBL4536031
Type:
Small organic molecule
Emp. Form.:
C38H44ClN5O3
Mol. Mass.:
654.241
SMILES:
COc1cc(Cl)c(cc1-c1ccc(CN[C@H](C)c2ccc(C)cc2)o1)C(=O)N[C@@H](CN[C@@H]1CC[C@H](N)CC1)Cc1ccc(cc1)C#N
: