Target
Somatostatin receptor type 2
Ligand
BDBM50075279
Substrate
Meas. Tech.
ChEBML_200682
Ki
7.3±n/a nM
Citation
 Pasternak, APan, YMarino, DSanderson, PEMosley, RRohrer, SPBirzin, ETHuskey, SEJacks, TSchleim, KDCheng, KSchaeffer, JMPatchett, AAYang, L Potent, orally bioavailable somatostatin agonists: good absorption achieved by urea backbone cyclization. Bioorg Med Chem Lett 9:491-6 (1999)  
Target
Name:
Somatostatin receptor type 2
Synonyms:
SOMATOSTATIN SST2 SS-2-R SS2R SSTR2 | Somatostatin receptor type 2 (SSTR2)
Type:
Enzyme
Mol. Mass.:
41344.94
Organism:
Homo sapiens (Human)
Description:
P30874
Residue:
369
  
Inhibitor
Name:
BDBM50075279
Synonyms:
(2R,3S)-N-(5-Amino-[1,3]dioxan-2-ylmethyl)-2-[3-(3,4-dichloro-benzyl)-2-oxo-imidazolidin-1-yl]-3-(1H-indol-3-yl)-butyramide | CHEMBL147092
Type:
Small organic molecule
Emp. Form.:
C27H31Cl2N5O4
Mol. Mass.:
560.472
SMILES:
C[C@H]([C@@H](N1CCN(Cc2ccc(Cl)c(Cl)c2)C1=O)C(=O)NC[C@H]1OC[C@H](N)CO1)c1c[nH]c2ccccc12
: