Target
Thromboxane-A synthase
Ligand
BDBM50003795
Substrate
Meas. Tech.
ChEMBL_209930 (CHEMBL813721)
IC50
4±n/a nM
Citation
 Soyka, RGuth, BDWeisenberger, HMLuger, PMüller, TH Guanidine derivatives as combined thromboxane A2 receptor antagonists and synthase inhibitors. J Med Chem 42:1235-49 (1999)  
Target
Name:
Thromboxane-A synthase
Synonyms:
CYP5 Cytochrome P450 5A1 TBXAS1 TXA synthase TXS Thromboxane A2 Synthase (P450 TxA2) Thromboxane prostanoid Thromboxane-A synthase
Type:
Enzyme
Mol. Mass.:
60524.67
Organism:
Homo sapiens (Human)
Description:
P24557
Residue:
533
  
Inhibitor
Name:
BDBM50003795
Synonyms:
5-[1-Pyridin-3-yl-1-(3-trifluoromethyl-phenyl)-meth-(E)-ylideneaminooxy]-pentanoic acid CHEMBL280728 ridogrel
Type:
Small organic molecule
Emp. Form.:
C18H17F3N2O3
Mol. Mass.:
366.3344
SMILES:
OC(=O)CCCCO\N=C(\c1cccnc1)c1cccc(c1)C(F)(F)F
: