Target
Prothrombin
Ligand
BDBM50072740
Substrate
Meas. Tech.
ChEBML_207975
IC50
5±n/a nM
Citation
 Plummer, JSBerryman, KACai, CCody, WLDiMaio, JDoherty, AMEaton, SEdmunds, JJHolland, DRLafleur, DLevesque, SNarasimhan, LSRubin, JRRapundalo, STSiddiqui, MASusser, ASt-Denis, YWinocour, P Potent and selective bicyclic lactam inhibitors of thrombin: Part 3: P1' modifications. Bioorg Med Chem Lett 9:835-40 (1999)  
Target
Name:
Prothrombin
Synonyms:
Activation peptide fragment 1 Coagulation factor II Prothrombin precursor Thrombin heavy chain | Thrombin light chain
Type:
Protein
Mol. Mass.:
70029.57
Organism:
Homo sapiens (Human)
Description:
P00734
Residue:
622
  
Inhibitor
Name:
BDBM50072740
Synonyms:
(6S,8aS)-4-Oxo-2-(3-phenyl-propionyl)-octahydro-pyrrolo[1,2-a]pyrazine-6-carboxylic acid [(S)-4-guanidino-1-(thiazole-2-carbonyl)-butyl]-amide (S)-4-Oxo-2-(3-phenyl-propionyl)-octahydro-pyrrolo[1,2-a]pyrazine-6-carboxylic acid [4-guanidino-1-((S)-thiazole-2-carbonyl)-butyl]-amide | CHEMBL324413
Type:
Small organic molecule
Emp. Form.:
C26H33N7O4S
Mol. Mass.:
539.65
SMILES:
NC(=N)NCCC[C@H](NC(=O)[C@@H]1CC[C@H]2CN(CC(=O)N12)C(=O)CCc1ccccc1)C(=O)c1nccs1
: