Target
Prothrombin
Ligand
BDBM50076227
Substrate
Meas. Tech.
ChEMBL_208522 (CHEMBL813617)
Ki
0.071±n/a nM
Citation
 Boatman, PDOgbu, COEguchi, MKim, HONakanishi, HCao, BShea, JPKahn, M Secondary structure peptide mimetics: design, synthesis, and evaluation of beta-strand mimetic thrombin inhibitors. J Med Chem 42:1367-75 (1999)  
Target
Name:
Prothrombin
Synonyms:
Activation peptide fragment 1 Coagulation factor II Prothrombin precursor Thrombin heavy chain | Thrombin light chain
Type:
Protein
Mol. Mass.:
70029.57
Organism:
Homo sapiens (Human)
Description:
P00734
Residue:
622
  
Inhibitor
Name:
BDBM50076227
Synonyms:
(1S,7S)-7-Amino-7-benzyl-hexahydro-pyrazolo[1,2-a]pyridazine-1-carboxylic acid ((S)-4-guanidino-1-phenethylaminooxalyl-butyl)-amide | CHEMBL28817
Type:
Small organic molecule
Emp. Form.:
C30H42N8O3
Mol. Mass.:
562.7063
SMILES:
NC(=N)NCCC[C@H](NC(=O)[C@@H]1CCN2CC[C@@](N)(Cc3ccccc3)CN12)C(=O)C(=O)NCCc1ccccc1
: