Target
Sphingomyelin phosphodiesterase 3
Ligand
BDBM50521428
Substrate
Meas. Tech.
ChEMBL_1884279 (CHEMBL4385861)
IC50
70±n/a nM
Citation
 Stepanek, OHin, NThomas, AGDash, RPAlt, JRais, RRojas, CSlusher, BSTsukamoto, T Neutral sphingomyelinase 2 inhibitors based on the 4-(1H-imidazol-2-yl)-2,6-dialkoxyphenol scaffold. Eur J Med Chem 170:276-289 (2019)  
Target
Name:
Sphingomyelin phosphodiesterase 3
Synonyms:
3.1.4.12 Neutral sphingomyelinase 2 SMPD3 nSMase-2 | nSMase2
Type:
PROTEIN
Mol. Mass.:
71072.54
Organism:
Homo sapiens
Description:
ChEMBL_119220
Residue:
655
  
Inhibitor
Name:
BDBM50521428
Synonyms:
CHEMBL4471548
Type:
Small organic molecule
Emp. Form.:
C20H22N2O3
Mol. Mass.:
338.4003
SMILES:
COc1cc(cc(OC)c1O)-c1nc(c([nH]1)C(C)C)-c1ccccc1
: