Target
Polyunsaturated fatty acid 5-lipoxygenase
Ligand
BDBM50076649
Substrate
Meas. Tech.
ChEMBL_4160 (CHEMBL619227)
IC50
10±n/a nM
Citation
 Connolly, PJWetter, SKBeers, KNHamel, SCChen, RHWachter, MPAnsell, JSinger, MMSteber, MRitchie, DMArgentieri, DC N-hydroxyurea and hydroxamic acid inhibitors of cyclooxygenase and 5-lipoxygenase. Bioorg Med Chem Lett 9:979-84 (1999)  
Target
Name:
Polyunsaturated fatty acid 5-lipoxygenase
Synonyms:
Alox5 LOX5_RAT
Type:
PROTEIN
Mol. Mass.:
78082.31
Organism:
Rattus norvegicus
Description:
ChEMBL_1432947
Residue:
673
  
Inhibitor
Name:
BDBM50076649
Synonyms:
CHEMBL369848 | N-{1-methyl-3-[1-(4-methoxyphenyl)-5-(4-chlorophenyl)-1H-pyrazol-3-yl]prop-2-ynyl}-N-hydroxyurea
Type:
Small organic molecule
Emp. Form.:
C21H19ClN4O3
Mol. Mass.:
410.854
SMILES:
COc1ccc(cc1)-n1nc(cc1-c1ccc(Cl)cc1)C#CC(C)N(O)C(N)=O
: