Target
Polyunsaturated fatty acid 5-lipoxygenase
Ligand
BDBM50076665
Substrate
Meas. Tech.
ChEMBL_4159 (CHEMBL619226)
IC50
2800±n/a nM
Citation
 Connolly, PJWetter, SKBeers, KNHamel, SCChen, RHWachter, MPAnsell, JSinger, MMSteber, MRitchie, DMArgentieri, DC N-hydroxyurea and hydroxamic acid inhibitors of cyclooxygenase and 5-lipoxygenase. Bioorg Med Chem Lett 9:979-84 (1999)  
Target
Name:
Polyunsaturated fatty acid 5-lipoxygenase
Synonyms:
Alox5 LOX5_RAT
Type:
PROTEIN
Mol. Mass.:
78082.31
Organism:
Rattus norvegicus
Description:
ChEMBL_1432947
Residue:
673
  
Inhibitor
Name:
BDBM50076665
Synonyms:
CHEMBL366423 | N-{1-methyl-3-[1-(4-methoxyphenyl)-5-(4-chlorophenyl)-1H-pyrazol-3-yl]prop-2-ynyl}-N-hydroxy-N'-propylurea
Type:
Small organic molecule
Emp. Form.:
C24H25ClN4O3
Mol. Mass.:
452.933
SMILES:
CCCNC(=O)N(O)C(C)C#Cc1cc(-c2ccc(Cl)cc2)n(n1)-c1ccc(OC)cc1
: